2-Undecenal, E-

Van Den Dool and Kratz RI, polar column, temperature ramp

Data compiled by: NIST Mass Spectrometry Data Center, William E. Wallace, director

Column type CapillaryCapillaryCapillaryCapillaryCapillary
Active phase RTX-WaxDB-WaxCarbowax 20MDB-WaxHP-Wax
Column length (m) 60.60.60.0.30.
Carrier gas HeN2He N2
Substrate
Column diameter (mm) 0.220.250.250.320.25
Phase thickness (μm) 0.250.250.250.50.25
Tstart (C) 60.70.45.40.60.
Tend (C) 230.230.250.240.220.
Heat rate (K/min) 2.2.2.7.5.
Initial hold (min)  2.0.17 10.
Final hold (min) 35.20. 5.
I 1739.1758.1722.1760.1710.
ReferencePaolini, Muselli, et al., 2007Choi, 2005Verzera, Campisi, et al., 2005Gocmen, Gurbuz, et al., 2004Campeol, Flamini, et al., 2003
Comment MSDC-RI MSDC-RI MSDC-RI MSDC-RI MSDC-RI
Column type CapillaryCapillaryCapillaryCapillaryCapillary
Active phase InnowaxDB-WaxDB-WaxZB-WaxDB-Wax
Column length (m) 15.60.30.60.60.
Carrier gas HeN2 HeN2
Substrate
Column diameter (mm) 0.250.250.320.320.25
Phase thickness (μm) 0.250.250.50.250.25
Tstart (C) 35.70.40.40.70.
Tend (C) 225.230.240.220.230.
Heat rate (K/min) 4.2.7.3.2.
Initial hold (min) 5.2.
Final hold (min) 20.20.5. 20.
I 1746.1761.1758.1714.1751.
ReferenceChisholm, Jell, et al., 2003Choi, 2003Valim, Rouseff, et al., 2003Brunton, Cronin, et al., 2002Choi, Kim. M.-S.L., et al., 2002
Comment MSDC-RI MSDC-RI MSDC-RI MSDC-RI MSDC-RI
Column type CapillaryCapillaryCapillaryCapillaryCapillary
Active phase DB-WaxDB-WaxCP-Wax 52CBDB-WaxCP-WAX 57CB
Column length (m) 30.60.60.60.50.
Carrier gas  HeHeN2
Substrate
Column diameter (mm) 0.250.250.250.250.32
Phase thickness (μm) 0.250.250.250.25
Tstart (C) 35.40.45.70.60.
Tend (C) 200.200.250.230.200.
Heat rate (K/min) 10.2.2.2.4.
Initial hold (min) 5.5.0.172.5.
Final hold (min) 30.30. 20.
I 1722.1753.1722.1761.1750.
ReferenceKaragül-Yüceer, Drake, et al., 2001Kim, 2001Verzera, Campisi, et al., 2001Choi and Sawamura, 2000Salter L.J., Mottram D.S., et al., 1988
Comment MSDC-RI MSDC-RI MSDC-RI MSDC-RI MSDC-RI

Kovats' RI, polar column, temperature ramp

Data compiled by: NIST Mass Spectrometry Data Center, William E. Wallace, director

Column type CapillaryCapillary
Active phase DB-WaxCarbowax 20M
Column length (m) 60.150.
Carrier gas HeHe
Substrate
Column diameter (mm) 0.250.64
Phase thickness (μm)
Tstart (C) 40.50.
Tend (C) 200.170.
Heat rate (K/min) 2.1.
Initial hold (min) 10.30.
Final hold (min)
I 1750.1740.
ReferenceUmano and Shibamoto, 1987Buttery, Kamm, et al., 1982
Comment MSDC-RI MSDC-RI

Kovats' RI, non-polar column, temperature ramp

Data compiled by: NIST Mass Spectrometry Data Center, William E. Wallace, director

Column type CapillaryCapillaryCapillaryCapillaryCapillary
Active phase CP Sil 8 CBDB-1BP-1SE-30SE-30
Column length (m) 30.9.550.50.50.
Carrier gas H2H2HeHeHe
Substrate
Column diameter (mm) 0.25  0.50.5
Phase thickness (μm) 0.25
Tstart (C) 50.50.-100.40.40.
Tend (C) 220.260.200.170.170.
Heat rate (K/min) 3.5.2.3.3.
Initial hold (min) 2.  3.3.
Final hold (min)
I 1355.1338.1342.1346.1347.
ReferenceSchwob, Bessiere, et al., 2004Smallfield, Perry, et al., 1994Bartley, 1988Greenberg, 1981Greenberg, 1981
Comment MSDC-RI MSDC-RI MSDC-RI MSDC-RI MSDC-RI

References

Paolini, Muselli, et al., 2007
Paolini, J.; Muselli, A.; Bernardini, A.-F.; Bighelli, A.; Casanova, J.; Costa, J., Thymol derivatives from essential oil of Doronicum corsicum L., Flavour Fragr. J., 2007, 22, 6, 479-487, https://doi.org/10.1002/ffj.1824 . [all data]

Choi, 2005
Choi, H.-S., Characteristic odor components of kumquat (Fortunella japonica Swingle) peel oil, J. Agric. Food Chem., 2005, 53, 5, 1642-1647, https://doi.org/10.1021/jf040324x . [all data]

Verzera, Campisi, et al., 2005
Verzera, A.; Campisi, S.; Zappalá, M., SUPELCO. Using SPME-GC-MS to characterize volatile components of honey as indicators of botanical origin, 2005, retrieved from http://www.sigmaaldrich.com/Brands/SupelcoHome/TheReporter.html. [all data]

Gocmen, Gurbuz, et al., 2004
Gocmen, D.; Gurbuz, O.; Rouseff, R.L.; Smoot, J.M.; Dagdelen, A.F., Gas chromatographic-olfactometric characterization of aroma active compounds in sun-dried and vacuum-dried tarhana, Eur. Food Res. Technol., 2004, 218, 6, 573-578, https://doi.org/10.1007/s00217-004-0913-6 . [all data]

Campeol, Flamini, et al., 2003
Campeol, E.; Flamini, G.; Cioni, P.L.; Morelli, I.; Cremonini, R.; Ceccarini, L., Volatile fractions from three cultivars of Olea eruopaea L. collected in two different seasons, J. Agric. Food Chem., 2003, 51, 7, 1994-1999, https://doi.org/10.1021/jf026025u . [all data]

Chisholm, Jell, et al., 2003
Chisholm, M.G.; Jell, J.A.; Cass, D.M., Jr., Characterization of the major odorants found in the peel oil of Citrus reticulata Blanco cv. Clementine using gas chromatography-olfactometry, Flavour Fragr. J., 2003, 18, 4, 275-281, https://doi.org/10.1002/ffj.1188 . [all data]

Choi, 2003
Choi, H.-S., Character impact odorants of Citrus Hallabong [(C. unshiu Marcov × C. sinensis Osbeck) × C. reticulata Blanco] cold-pressed peel oil, J. Agric. Food Chem., 2003, 51, 9, 2687-2692, https://doi.org/10.1021/jf021069o . [all data]

Valim, Rouseff, et al., 2003
Valim, M.F.; Rouseff, R.L.; Lin, J., Gas chromatographic-olfactometric characterization of aroma compounds in two types of cashew apple nectar, J. Agric. Food Chem., 2003, 51, 4, 1010-1015, https://doi.org/10.1021/jf025738+ . [all data]

Brunton, Cronin, et al., 2002
Brunton, N.P.; Cronin, D.A.; Monahan, F.J., Volatile components associated with freshly cooked and oxidized off-flavours in turkey breast meat, Flavour Fragr. J., 2002, 17, 5, 327-334, https://doi.org/10.1002/ffj.1087 . [all data]

Choi, Kim. M.-S.L., et al., 2002
Choi, H.-S.; Kim. M.-S.L.; Sawamura, M., Constituents of the essential oil of cnidium officinale Makino, a Korean medicinal plant, Flavour Fragr. J., 2002, 17, 1, 49-53, https://doi.org/10.1002/ffj.1038 . [all data]

Karagül-Yüceer, Drake, et al., 2001
Karagül-Yüceer, Y.; Drake, M.; Cadwallader, K.R., Aroma-active components of nonfat dry milk, J. Agric. Food Chem., 2001, 49, 6, 2948-2953, https://doi.org/10.1021/jf0009854 . [all data]

Kim, 2001
Kim, J.S., Einfluss der Temperatur beim Rösten von Sesam auf Aroma und antioxidative Eigenschaften des Öls, PhD Thesis, Technischen Universität Berlin zur Erlangung des akademischen Grades, Berlin, 2001, 151. [all data]

Verzera, Campisi, et al., 2001
Verzera, A.; Campisi, S.; Zappalá, M.; Bonaccorsi, I., SPME-GC-MS analysis of honey volatile components for the characterization of different floral origin, Am. Lab. Fairfield Conn., 2001, 33, 15, 18-21. [all data]

Choi and Sawamura, 2000
Choi, H.-S.; Sawamura, M., Composition of the essential oil of Citrus tamurana Hort. ex Tanaka (Hyuganatsu), J. Agric. Food Chem., 2000, 48, 10, 4868-4873, https://doi.org/10.1021/jf000651e . [all data]

Salter L.J., Mottram D.S., et al., 1988
Salter L.J.; Mottram D.S.; Whitfield, Volatile compounds produces in Maillard reactions involving glycine, ribose and phospholid, J. Sci. Food Agric., 1988, 46, 2, 227-242, https://doi.org/10.1002/jsfa.2740460211 . [all data]