2-Butanol, 3-methyl-, acetate

Kovats' RI, polar column, isothermal

Data compiled by: NIST Mass Spectrometry Data Center, William E. Wallace, director

Column type Packed
Active phase Carbowax 20M
Column length (m) 2.
Carrier gas
Substrate Chromosorb W
Column diameter (mm)
Phase thickness (μm)
Temperature (C) 100.
I 1067.
ReferenceZarazir, Chovin, et al., 1970
Comment MSDC-RI

Kovats' RI, non-polar column, isothermal

View large format table.

Column type Active phase Temperature (C) I Reference Comment
PackedSE-30100.812.Zarazir, Chovin, et al., 1970Chromosorb W; Column length: 2. m

Van Den Dool and Kratz RI, non-polar column, temperature ramp

View large format table.

Column type Active phase I Reference Comment
Capillary5 % Phenyl methyl siloxane832.Zaikin, 201030. m/0.25 mm/0.25 μm, 15. K/min, 270. C @ 15. min; Tstart: 60. C
CapillarySE-30811.Korhonen, 19846. K/min; Column length: 25. m; Column diameter: 0.3 mm; Tstart: 50. C

Van Den Dool and Kratz RI, non-polar column, custom temperature program

View large format table.

Column type Active phase I Reference Comment
CapillaryVF-5MS827.1Tret'yakov, 200830. m/0.25 mm/0.25 μm, He; Program: Multi-step temperature program; T(initial)=60C; T(final)=270C

Van Den Dool and Kratz RI, polar column, temperature ramp

View large format table.

Column type Active phase I Reference Comment
CapillaryOV-3511036.Korhonen, 19846. K/min; Column length: 25. m; Column diameter: 0.32 mm; Tstart: 50. C
CapillaryCarbowax 20M1064.Chen, Kuo, et al., 1982He, 50. C @ 10. min, 1. K/min; Tend: 160. C

Normal alkane RI, non-polar column, temperature ramp

View large format table.

Column type Active phase I Reference Comment
CapillaryZB-1850.Mierendorff, Stahl-Biskup, et al., 200830. m/0.25 mm/0.25 μm, Nitrogen, 3. K/min; Tstart: 45. C; Tend: 230. C
CapillaryZB-1850.Mierendorff, Stahl-Biskup, et al., 200330. m/0.25 mm/0.25 μm, N2, 3. K/min; Tstart: 45. C; Tend: 230. C

Normal alkane RI, non-polar column, custom temperature program

View large format table.

Column type Active phase I Reference Comment
CapillaryOV-1, SE-30, Methyl silicone, SP-2100, OV-101, DB-1, etc.811.Waggott and Davies, 1984Hydrogen; Column length: 50. m; Column diameter: 0.32 mm; Program: not specified

References

Zarazir, Chovin, et al., 1970
Zarazir, D.; Chovin, P.; Guiochon, G., Identification of hydroxylic compounds and their derivatives by gas chromatography, Chromatographia, 1970, 3, 4, 180-195, https://doi.org/10.1007/BF02269018 . [all data]