Titanium,[(1,2,3,4,5-)-1,2,3,4,5-pentamethyl-2,4-cyclopentadien-1-yl](6-1,2,3,4-tetramethyl-5-methylene-1,3-cyclopentadiene)-

Gas phase ion energetics data

Data compiled by: Sharon G. Lias and Joel F. Liebman

Ionization energy determinations

IE (eV) Method Reference Comment
5.54PEVondrak, Mach, et al., 1992Vertical value

References

Vondrak, Mach, et al., 1992
Vondrak, T.; Mach, K.; Varga, V.; Terpstra, A., Frontier occupied orbitals in methyl-substituted fulvene and dimethylenecyclopentenyltitanium complexes by UV-photoelectron spectroscopy and EHT calculations, J. Organomet. Chem., 1992, 425, 27. [all data]