3,3,4-Trimethylpentan-2-one

Gas phase thermochemistry data

Data compiled by: Hussein Y. Afeefy, Joel F. Liebman, and Stephen E. Stein

Quantity Value Units Method Reference Comment
Δfgas-328.4 ± 1.7kJ/molCcbDubois and Herzog, 1972

Phase change data

Data compiled by: Thermodynamics Research Center, NIST Boulder Laboratories, Chris Muzny director

Quantity Value Units Method Reference Comment
Tboil425.65KN/APomerantz, Mears, et al., 1949Uncertainty assigned by TRC = 2. K

In addition to the Thermodynamics Research Center (TRC) data available from this site, much more physical and chemical property data is available from the following TRC products:

References

Dubois and Herzog, 1972
Dubois, J.-E.; Herzog, H., Heats of formation of aliphatic ketones: Structure correlation based on environment treatment, J. Chem. Soc. Chem. Commun., 1972, 932-933. [all data]

Pomerantz, Mears, et al., 1949
Pomerantz, P.; Mears, T.W.; Howard, F.L., Separation and Identification of the Major C1 to C10 Components of Triptene Residue, J. Res. Natl. Bur. Stand. (U. S.), 1949, 42, 617-32. [all data]