Neopentyl pivalate

Phase change data

Data compiled by: William E. Acree, Jr., James S. Chickos

Quantity Value Units Method Reference Comment
Δvap48.9 ± 0.5kJ/molGSVerevkin and Heintz, 1999Based on data from 280. - 310. K.

Enthalpy of vaporization

ΔvapH (kJ/mol) Temperature (K) Method Reference Comment
49.1 ± 0.5295.GSVerevkin and Heintz, 1999Based on data from 280. - 310. K.

References

Verevkin and Heintz, 1999
Verevkin, Sergey P.; Heintz, Andreas, Determination of Vaporization Enthalpies of the Branched Esters from Correlation Gas Chromatography and Transpiration Methods, J. Chem. Eng. Data, 1999, 44, 6, 1240-1244, https://doi.org/10.1021/je990122a . [all data]