Hexanoic acid, 2-hexenyl ester, (E)-

Normal alkane RI, polar column, temperature ramp

Data compiled by: NIST Mass Spectrometry Data Center, William E. Wallace, director

Column type CapillaryCapillaryCapillaryCapillaryCapillary
Active phase DB-WaxCarbowax 20MPEG-20MPEG-20MDB-Wax
Column length (m) 60.60.50.50.60.
Carrier gas H2 HeHeH2
Substrate
Column diameter (mm) 0.320.250.250.250.25
Phase thickness (μm) 0.25 0.150.150.25
Tstart (C) 40.60.60.60.30.
Tend (C) 230.180.180.180.180.
Heat rate (K/min) 4.2.2.2.2.
Initial hold (min) 5.4.4.4.2.
Final hold (min) 25.
I 1663.1636.1639.1640.1668.
ReferenceDregus and Engel, 2003Kawakami, Ganguly, et al., 1995Togari, Kobayashi, et al., 1995Togari, Kobayashi, et al., 1995Takeoka, Flath, et al., 1988
Comment MSDC-RI MSDC-RI MSDC-RI MSDC-RI MSDC-RI
Column type Capillary
Active phase DB-Wax
Column length (m) 60.
Carrier gas H2
Substrate
Column diameter (mm) 0.25
Phase thickness (μm) 0.25
Tstart (C) 30.
Tend (C) 180.
Heat rate (K/min) 2.
Initial hold (min) 2.
Final hold (min)
I 1668.
ReferenceTakeoka, Flath, et al., 1988
Comment MSDC-RI

Kovats' RI, non-polar column, custom temperature program

Data compiled by: NIST Mass Spectrometry Data Center, William E. Wallace, director

Column type Capillary
Active phase BP-1
Column length (m) 30.
Carrier gas N2
Substrate
Column diameter (mm) 0.32
Phase thickness (μm) 0.25
Program 60C => 5C/min => 220C (5min) => 3C/min => 245C(5min)
I 1379.
ReferenceKhan, Verma, et al., 2006
Comment MSDC-RI

Kovats' RI, non-polar column, temperature ramp

Data compiled by: NIST Mass Spectrometry Data Center, William E. Wallace, director

Column type Capillary
Active phase CP Sil 5 CB
Column length (m) 25.
Carrier gas
Substrate
Column diameter (mm) 0.25
Phase thickness (μm)
Tstart (C) 60.
Tend (C) 280.
Heat rate (K/min) 5.
Initial hold (min)
Final hold (min)
I 1368.
ReferenceKaul and Vats, 1998
Comment MSDC-RI

Van Den Dool and Kratz RI, polar column, temperature ramp

Data compiled by: NIST Mass Spectrometry Data Center, William E. Wallace, director

Column type CapillaryCapillaryCapillaryCapillary
Active phase AT-WaxDB-WaxDB-WaxDB-Wax
Column length (m) 60.30.30.30.
Carrier gas He HeHe
Substrate
Column diameter (mm) 0.320.320.250.25
Phase thickness (μm) 0.250.250.250.25
Tstart (C) 65.40.50.50.
Tend (C) 250.230.250.250.
Heat rate (K/min) 2.3.4.4.
Initial hold (min) 10.4.3.3.
Final hold (min) 60.
I 1654.1660.1667.1669.
ReferencePino and Marbot, 2001Ruther, 2000Fröhlich, Duque, et al., 1989Fröhlich, Duque, et al., 1989
Comment MSDC-RI MSDC-RI MSDC-RI MSDC-RI

Van Den Dool and Kratz RI, non-polar column, temperature ramp

Data compiled by: NIST Mass Spectrometry Data Center, William E. Wallace, director

Column type CapillaryCapillary
Active phase CP Sil 5 CBHP-5
Column length (m) 50.30.
Carrier gas He
Substrate
Column diameter (mm) 0.320.32
Phase thickness (μm) 0.40.25
Tstart (C) 60.40.
Tend (C) 280.280.
Heat rate (K/min) 3.3.
Initial hold (min) 10.4.
Final hold (min) 60.
I 1370.1391.
ReferencePino and Marbot, 2001Ruther, 2000
Comment MSDC-RI MSDC-RI

Normal alkane RI, polar column, custom temperature program

Data compiled by: NIST Mass Spectrometry Data Center, William E. Wallace, director

Column type Capillary
Active phase Carbowax 20M
Column length (m)
Carrier gas
Substrate
Column diameter (mm)
Phase thickness (μm)
Program not specified
I 1656.
ReferenceVinogradov, 2004
Comment MSDC-RI

References

Dregus and Engel, 2003
Dregus, M.; Engel, K.-H., Volatile constituents of uncooked Rhubarb (Rheum rhabarbarum L.) stalks, J. Agric. Food Chem., 2003, 51, 22, 6530-6536, https://doi.org/10.1021/jf030399l . [all data]

Kawakami, Ganguly, et al., 1995
Kawakami, M.; Ganguly, S.N.; Banerjee, J.; Kobayashi, A., Aroma composition of oolong tea and black tea by brewed extraction method and characterizing compounds of Darjeeling tea aroma, J. Agric. Food Chem., 1995, 43, 1, 200-207, https://doi.org/10.1021/jf00049a037 . [all data]

Togari, Kobayashi, et al., 1995
Togari, N.; Kobayashi, A.; Aishima, T., Pattern recognition applied to gas chromatographic profiles of volatile components in three tea categories, Food Res. Int., 1995, 28, 5, 495-502, https://doi.org/10.1016/0963-9969(95)00029-1 . [all data]

Takeoka, Flath, et al., 1988
Takeoka, G.R.; Flath, R.A.; Güntert, M.; Jennings, W., Nectarine volatiles: vacuum steam distillation versus headspace sampling, J. Agric. Food Chem., 1988, 36, 3, 553-560, https://doi.org/10.1021/jf00081a037 . [all data]