2-Hexen-1-ol, propanoate, (E)-

Kovats' RI, non-polar column, isothermal

Data compiled by: NIST Mass Spectrometry Data Center, William E. Wallace, director

Column type Packed
Active phase SE-30
Column length (m) 3.7
Carrier gas He
Substrate Celatom silanized (62-72 mesh)
Column diameter (mm)
Phase thickness (μm)
Temperature (C) 150.
I 1070.
ReferenceAshes and Haken, 1975
Comment MSDC-RI

References

Ashes and Haken, 1975
Ashes, J.R.; Haken, J.K., Gas chromatography of homologous esters. IX. Structure-retention increments of unsaturated esters, J. Chromatogr., 1975, 111, 1, 171-187, https://doi.org/10.1016/S0021-9673(01)80159-X . [all data]