N-2-(5-picolyl)-N'-(4-chlorophenyl) thiourea

Phase change data

Data compiled by: William E. Acree, Jr., James S. Chickos

Enthalpy of fusion

ΔfusH (kcal/mol) Temperature (K) Method Reference
12.2473.7DSCSzczepura, Kelman, et al., 2002

References

Szczepura, Kelman, et al., 2002
Szczepura, Lisa F.; Kelman, Diantha R.; Hermetet, Anne K.; Ackerman, Lily J.; Goldberg, Karen I.; Claborn, Kacey A.; Kaminsky, Werner; West, Douglas X., Structural, spectral and thermal studies of N-2-(picolyl)-N´-4-chlorophenylthioureas, Journal of Molecular Structure, 2002, 608, 2-3, 245-251, https://doi.org/10.1016/S0022-2860(01)00966-8 . [all data]