1,2,4-Benzenetriol

Phase change data

Data compiled as indicated in comments:
AC - William E. Acree, Jr., James S. Chickos
ALS - Hussein Y. Afeefy, Joel F. Liebman, and Stephen E. Stein
DRB - Donald R. Burgess, Jr.

Quantity Value Units Method Reference Comment
Δsub124.2 ± 0.6kJ/molGSVerevkin and Schick, 2004Based on data from 341. - 382. K.; AC
Δsub119.8 ± 1.2kJ/molCRibeiro Da Silva, Ribeiro Da Silva, et al., 1986ALS
Δsub119.8kJ/molN/ARibeiro Da Silva, Ribeiro Da Silva, et al., 1986DRB
Δsub119.8 ± 1.6kJ/molCRibeiro Da Silva, Ribeiro Da Silva, et al., 1986AC

Enthalpy of fusion

ΔfusH (kJ/mol) Temperature (K) Reference Comment
28.8413.2Verevkin and Schick, 2004AC

Gas phase thermochemistry data

Data compiled by: Hussein Y. Afeefy, Joel F. Liebman, and Stephen E. Stein

Quantity Value Units Method Reference Comment
Δfgas-444.0 ± 1.6kJ/molCcbRibeiro Da Silva, Ribeiro Da Silva, et al., 1986

References

Verevkin and Schick, 2004
Verevkin, Sergey P.; Schick, Christoph, Determination of vapor pressures, enthalpies of sublimation, and enthalpies of fusion of benzenetriols, Thermochimica Acta, 2004, 415, 1-2, 35-42, https://doi.org/10.1016/j.tca.2003.09.011 . [all data]

Ribeiro Da Silva, Ribeiro Da Silva, et al., 1986
Ribeiro Da Silva, M.D.M.C.; Ribeiro Da Silva, M.A.V.; Pilcher, G., Enthalpies of combustion of the three trihydroxybenzenes and of 3-methoxycatechol and 4-nitrocatechol, J. Chem. Thermodyn., 1986, 18, 295-300. [all data]