N-(n-Propyl)acetamide

Kovats' RI, non-polar column, isothermal

View large format table.

Column type Active phase Temperature (C) I Reference Comment
PackedSE-30180.974.Krawczyk and Piotrowski, 1989N2, Chromosorb W AW; Column length: 1. m
PackedApiezon L150.975.Zhuravleva I.L., Golovnya R.V., et al., 1978N2, Chromosorb G-AW; Column length: 2.7 m

Kovats' RI, polar column, isothermal

View large format table.

Column type Active phase Temperature (C) I Reference Comment
PackedPolyethylene Glycol150.1802.Zhuravleva I.L., Golovnya R.V., et al., 1978N2, Chromosorb G-AW; Column length: 2.7 m

Normal alkane RI, non-polar column, custom temperature program

View large format table.

Column type Active phase I Reference Comment
CapillaryPolydimethyl siloxanes974.Zenkevich and Chupalov, 1996Program: not specified

References

Krawczyk and Piotrowski, 1989
Krawczyk, W.; Piotrowski, G.T., Relationships Between Structure and Retention Index for N-Substituted Amides of Aliphatic Acids on a Non-Polar Column, J. Chromatogr., 1989, 463, 297-304, https://doi.org/10.1016/S0021-9673(01)84484-8 . [all data]

Zhuravleva I.L., Golovnya R.V., et al., 1978
Zhuravleva I.L.; Golovnya R.V.; Palamarchuk L.F.; Kishkovskii Z.N., Gas-chromatographic determination of N-monoalkylacetamides, J. Anal. Chem. USSR (Engl. Transl.), 1978, 33, 11, 1717-1719. [all data]

Zenkevich and Chupalov, 1996
Zenkevich, I.G.; Chupalov, A.A., New Possibilities of Chromato Mass Pectrometric Identification of Organic Compounds Using Increments of Gas Chromatographic Retention Indices of Molecular Structural Fragments, Zh. Org. Khim. (Rus.), 1996, 32, 5, 656-666. [all data]