2-Hexanamine

Phase change data

Data compiled by: Thermodynamics Research Center, NIST Boulder Laboratories, Chris Muzny director

Quantity Value Units Method Reference Comment
Tboil389.15KN/AIffland and Yen, 1954Uncertainty assigned by TRC = 3. K

In addition to the Thermodynamics Research Center (TRC) data available from this site, much more physical and chemical property data is available from the following TRC products:

Normal alkane RI, non-polar column, custom temperature program

View large format table.

Column type Active phase I Reference Comment
CapillaryMethyl Silicone720.Zenkevich, 1999Program: not specified

References

Iffland and Yen, 1954
Iffland, D.C.; Yen, T.-F., Preparation of Amines by Low Pressure Hydrogenation of Oximes, J. Am. Chem. Soc., 1954, 76, 4180. [all data]

Zenkevich, 1999
Zenkevich, I.G., Dependence of Gas Chromatographic Retention Indices on Dynamics Molecular Characteristics, Zh. Fiz. Khim., 1999, 73, 5, 905-910. [all data]