Naphthalene, 1-ethoxy-

Phase change data

Data compiled as indicated in comments:
BS - Robert L. Brown and Stephen E. Stein
TRC - Thermodynamics Research Center, NIST Boulder Laboratories, Chris Muzny director

Quantity Value Units Method Reference Comment
Tboil553.7KN/AWeast and Grasselli, 1989BS
Tboil552.95KN/APerkin, 1896Uncertainty assigned by TRC = 1. K; TRC

In addition to the Thermodynamics Research Center (TRC) data available from this site, much more physical and chemical property data is available from the following TRC products:

References

Weast and Grasselli, 1989
CRC Handbook of Data on Organic Compounds, 2nd Editon, Weast,R.C and Grasselli, J.G., ed(s)., CRC Press, Inc., Boca Raton, FL, 1989, 1. [all data]

Perkin, 1896
Perkin, W.H., LXIX. On Magnetic Rotatory Power, especially of Aromatic Compounds, J. Chem. Soc., 1896, 69, 1025-1257. [all data]

Kracmar and Kracmarowa, 1974
Kracmar, J.; Kracmarowa, J., Die Pharmazie, 1974, 29, 462. [all data]