ar-Turmerone

Kovats' RI, non-polar column, temperature ramp

Data compiled by: NIST Mass Spectrometry Data Center, William E. Wallace, director

Column type CapillaryCapillaryCapillaryCapillary
Active phase BP-1SPB-1SPB-1BP-1
Column length (m) 30.30.30.25.
Carrier gas N2HeHeN2
Substrate
Column diameter (mm) 0.320.320.320.55
Phase thickness (μm) 0.250.250.250.25
Tstart (C) 60.60.60.60.
Tend (C) 220.225.225.220.
Heat rate (K/min) 5.2.2.5.
Initial hold (min)  3.3.
Final hold (min) 3.5.5.15.
I 1638.1628.1632.1640.
ReferenceSrivastava, Srivastava, et al., 2006Jayaprakasha, Jena, et al., 2002Jayaprakasha, Jena, et al., 2002Raina, Srivastava, et al., 2002
Comment MSDC-RI MSDC-RI MSDC-RI MSDC-RI

Van Den Dool and Kratz RI, non-polar column, temperature ramp

Data compiled by: NIST Mass Spectrometry Data Center, William E. Wallace, director

Column type CapillaryCapillaryCapillaryCapillary
Active phase DB-5HP-5MSHP-5MSUltra-1
Column length (m) 50.30.30.25.
Carrier gas N2HeHeHe
Substrate
Column diameter (mm) 0.20.250.250.32
Phase thickness (μm) 0.320.250.250.52
Tstart (C) 60.60.60.35.
Tend (C) 220.250.275.320.
Heat rate (K/min) 5.4.4.15.
Initial hold (min) 3.2.
Final hold (min) 5.20. 10.
I 1664.1664.1665.1638.
ReferenceEsmaeili, Nematollahi, et al., 2006Pino, Mesa, et al., 2005Afsharypuor and Suleimany, 2002Richmond and Pombo-Villar, 1998
Comment MSDC-RI MSDC-RI MSDC-RI MSDC-RI

References

Srivastava, Srivastava, et al., 2006
Srivastava, A.K.; Srivastava, S.K.; Syamsundar, K.V., Volatile composition of Curcuma angustifolia Roxb. rhizome from central and southern India, Flavour Fragr. J., 2006, 21, 3, 423-426, https://doi.org/10.1002/ffj.1680 . [all data]

Jayaprakasha, Jena, et al., 2002
Jayaprakasha, G.K.; Jena, B.S.; Negi, P.S.; Sakariah, K.K., Evaluation of antioxidant activities and antimutagenicity of turmeric oil: a byproduct from curcumin production, Z. Naturforsch. C:, 2002, 57c, 828-835, retrieved from http://www.znaturforsch.com/57c/s57c0828.pdf. [all data]

Raina, Srivastava, et al., 2002
Raina, V.K.; Srivastava, S.K.; Jain, N.; Ahmad, A.; Syamasundar, K.V.; Aggarwal, K.K., Essential oil composition of Curcuma longa L. cv. Roma from the plains of northern India, Flavour Fragr. J., 2002, 17, 2, 99-102, https://doi.org/10.1002/ffj.1053 . [all data]