Phosphonous diamide,N,N,N',N'-tetramethyl-p-(1,2,3,5-tetramethyl-1,2,4,3,5-triazaborolidin-4-yl)-

Gas phase ion energetics data

Data compiled by: Sharon G. Lias, Rhoda D. Levin, and Sherif A. Kafafi

Ionization energy determinations

IE (eV) Method Reference Comment
7.57PEKroner, Nolle, et al., 1975Vertical value

References

Kroner, Nolle, et al., 1975
Kroner, J.; Nolle, D.; Noth, H.; Winterstein, W., Photoelektronenspektroskopische untersuchungen an bor-verbindungen, II funfgliedrige hetero - cyclen des bors, Chem. Ber., 1975, 108, 3807. [all data]