N-n-Propylphthalimide

Phase change data

Data compiled by: William E. Acree, Jr., James S. Chickos

Quantity Value Units Method Reference Comment
Δsub98.2 ± 1.4kJ/molCRibeiro da Silva, Santos, et al., 2006

References

Ribeiro da Silva, Santos, et al., 2006
Ribeiro da Silva, M.A.V.; Santos, C.P.F.; Monte, M.J.S.; Sousa, C.A.D., Thermochemical studies of phthalimide and two N-alkylsubstituted phthalimides (ALKYL=ETHYL AND n-PROPYL), J Therm Anal Calorim, 2006, 83, 3, 533-539, https://doi.org/10.1007/s10973-005-7448-3 . [all data]