2(3H)-Thiazolethione,3,4-dimethyl-

Gas phase ion energetics data

Data compiled by: Sharon G. Lias, Rhoda D. Levin, and Sherif A. Kafafi

Ionization energy determinations

IE (eV) Method Reference Comment
7.55 ± 0.03PEGuimon, Pfister-Guillouzo, et al., 1974Vertical value

References

Guimon, Pfister-Guillouzo, et al., 1974
Guimon, C.; Pfister-Guillouzo, G.; Arbelot, M.; Chanon, M., Electronic structure of sulphur compounds. VII. Photoelectron spectra of thiocarbonyl J. Heterocycl. Chem.., Tetrahedron, 1974, 30, 3831. [all data]