Estrone

Kovats' RI, non-polar column, isothermal

Data compiled by: NIST Mass Spectrometry Data Center, William E. Wallace, director

Column type CapillaryCapillaryCapillary
Active phase CP Sil 5 CBCP Sil 5 CBCP Sil 5 CB
Column length (m) 10.10.10.
Carrier gas
Substrate
Column diameter (mm) 0.250.250.25
Phase thickness (μm)
Temperature (C) 200.205.210.
I 2736.62755.92756.2
ReferenceNovakovic, Tvrzicka, et al., 1995Novakovic, Tvrzicka, et al., 1995Novakovic, Tvrzicka, et al., 1995
Comment MSDC-RI MSDC-RI MSDC-RI

References

Novakovic, Tvrzicka, et al., 1995
Novakovic, J.; Tvrzicka, E.; Vsetecka, V.; Pouzar, V.; Feltl, L., Capillary gas-chromatographic retention behavior and physico-chemical properties of underivatized equine estrogens, Collect. Czech. Chem. Commun., 1995, 60, 5, 813-819, https://doi.org/10.1135/cccc19950813 . [all data]