2H-1-Benzopyran-2-one, 7-methoxy-

Van Den Dool and Kratz RI, non-polar column, custom temperature program

View large format table.

Column type Active phase I Reference Comment
CapillaryHP-5MS1732.3Andriamaharavo, 201430. m/0.25 mm/0.25 μm, He; Program: 60C (1 min) => 5 C/min => 210C => 10 C/min => 280C (15 min)

Van Den Dool and Kratz RI, polar column, temperature ramp

View large format table.

Column type Active phase I Reference Comment
CapillarySupelcowax2981.Chisholm, Wilson, et al., 200325. m/0.25 mm/0.25 μm, 35. C @ 5. min, 4. K/min, 225. C @ 10. min

Normal alkane RI, polar column, temperature ramp

View large format table.

Column type Active phase I Reference Comment
CapillarySupelcowax2910.Näf and Velluz, 1998He, 5. K/min; Column length: 60. m; Column diameter: 0.25 mm; Tstart: 80. C; Tend: 240. C

References

De Schryver, et al., 1974
De Schryver, F.C., et al., J. Am. Chem. Soc., 1974, 96, 6994. [all data]

Andriamaharavo, 2014
Andriamaharavo, N.R., Retention Data. NIST Mass Spectrometry Data Center., NIST Mass Spectrometry Data Center, 2014. [all data]

Chisholm, Wilson, et al., 2003
Chisholm, M.G.; Wilson, M.A.; Gaskey, G.M., Characterization of aroma volatiles in key lime essential oils (Cirtrus aurantifolia Swingle), Flavour Fragr. J., 2003, 18, 2, 106-115, https://doi.org/10.1002/ffj.1172 . [all data]

Näf and Velluz, 1998
Näf, R.; Velluz, A., Phenols and lactones in Italo-Mitcham peppermint oil Mentha × piperita L., Flavour Fragr. J., 1998, 13, 3, 203-208, https://doi.org/10.1002/(SICI)1099-1026(199805/06)13:3<203::AID-FFJ725>3.0.CO;2-0 . [all data]