1-Hydroxypyrene

Phase change data

Data compiled as indicated in comments:
TRC - Thermodynamics Research Center, NIST Boulder Laboratories, Chris Muzny director
AC - William E. Acree, Jr., James S. Chickos

Quantity Value Units Method Reference Comment
Tfus480.KN/AVollman, Becker, et al., 1937Uncertainty assigned by TRC = 4. K; TRC

Enthalpy of sublimation

ΔsubH (kJ/mol) Temperature (K) Method Reference Comment
129.0 ± 3.2382.MEOja and Suuberg, 1998Based on data from 369. - 394. K.; AC

In addition to the Thermodynamics Research Center (TRC) data available from this site, much more physical and chemical property data is available from the following TRC products:

References

Vollman, Becker, et al., 1937
Vollman, H.; Becker, H.; Correll, M.; Streeck, H.; Langbein, G., Pyrene and Its Derivatives, Justus Liebigs Ann. Chem., 1937, 531, 1-159. [all data]

Oja and Suuberg, 1998
Oja, Vahur; Suuberg, Eric M., Vapor Pressures and Enthalpies of Sublimation of Polycyclic Aromatic Hydrocarbons and Their Derivatives, J. Chem. Eng. Data, 1998, 43, 3, 486-492, https://doi.org/10.1021/je970222l . [all data]