Borazine, 2,4,6-trimethyl-

Gas phase ion energetics data

Data compiled as indicated in comments:
LLK - Sharon G. Lias, Rhoda D. Levin, and Sherif A. Kafafi
RDSH - Henry M. Rosenstock, Keith Draxl, Bruce W. Steiner, and John T. Herron

Ionization energy determinations

IE (eV) Method Reference Comment
9.30EIKuznesof, Stafford, et al., 1967RDSH
9.50PEBrundle and Jones, 1973Vertical value; LLK
9.64 ± 0.03PELloyd and Lynaugh, 1971Vertical value; LLK

References

Kuznesof, Stafford, et al., 1967
Kuznesof, P.M.; Stafford, F.E.; Shriver, D.F., Electron impact ionization potentials of methyl-substituted borazines, J. Phys. Chem., 1967, 71, 1939. [all data]

Brundle and Jones, 1973
Brundle, C.R.; Jones, G.R., The high resolution photoelectron spectra and the electronic structure of XeOF4, J. Electron Spectrosc. Relat. Phenom., 1973, 1, 403. [all data]

Lloyd and Lynaugh, 1971
Lloyd, D.R.; Lynaugh, N., Photoelectron spectra of the symmetric trimethylborazines, Chem. Commun., 1971, 3, 125. [all data]

Kroner, et al., 1972
Kroner, J., et al., Tetrahedron, 1972, 28, 1585. [all data]