PYRIMETHANIL

Van Den Dool and Kratz RI, non-polar column, temperature ramp

Data compiled by: NIST Mass Spectrometry Data Center, William E. Wallace, director

Column type CapillaryCapillaryCapillary
Active phase VF-5MSSLB-5MSSLB-5MS
Column length (m) 30.30.30.
Carrier gas HeHeHe
Substrate
Column diameter (mm) 0.250.250.25
Phase thickness (μm) 0.250.250.25
Tstart (C) 60.70.70.
Tend (C) 270.300.300.
Heat rate (K/min)  2.2.
Initial hold (min)
Final hold (min)
I 1813.1789.1796.
ReferenceN/AMondello, Casilli, et al., 2007Mondello, Casilli, et al., 2007
Comment MSDC-RI MSDC-RI MSDC-RI

References

Mondello, Casilli, et al., 2007
Mondello, L.; Casilli, A.; Tranchida, P.Q.; Presti, M.L.; Dugo, P.; Dugo, G., Comprehensive gas chromatography coupled to mass spectrometry for the separation of pesticides in a very complex matrix, Anal. Bioanal. Chem., 2007, 389, 6, 1755-1763, https://doi.org/10.1007/s00216-007-1412-y . [all data]