Arsine, (trifluorosilyl)-

Gas phase ion energetics data

Data compiled by: Sharon G. Lias, Rhoda D. Levin, and Sherif A. Kafafi

Ionization energy determinations

IE (eV) Method Reference Comment
10.90 ± 0.05PEDemuth, 1977Vertical value

References

Demuth, 1977
Demuth, R., Photoelektronenspektren von einigen Trihalogensilylphosphanen und -arsanen X3SiER2 (X = F, Cl; E = N, P, As; R = H, CH3), Z. Naturforsch. B:, 1977, 32, 1252. [all data]