Methoxyphedrine

Van Den Dool and Kratz RI, non-polar column, temperature ramp

View large format table.

Column type Active phase I Reference Comment
CapillaryVF-5MS1649.6Tretyakov, 201430. m/0.25 mm/0.25 μm, He; Tstart: 60. C; Tend: 270. C

References

Tretyakov, 2014
Tretyakov, K.V., Retention Data. NIST Mass Spectrometry Data Center., NIST Mass Spectrometry Data Center, 2014. [all data]