N-stearoylmorpholine

Phase change data

Data compiled by: Thermodynamics Research Center, NIST Boulder Laboratories, Chris Muzny director

Quantity Value Units Method Reference Comment
Tfus325.45KN/AMod, Magne, et al., 1962Uncertainty assigned by TRC = 0.5 K

In addition to the Thermodynamics Research Center (TRC) data available from this site, much more physical and chemical property data is available from the following TRC products:

References

Mod, Magne, et al., 1962
Mod, R.R.; Magne, F.C.; Skau, E.L., J. Chem. Eng. Data, 1962, 7, 31. [all data]