9-Fluoroanthracene

Gas phase ion energetics data

Data compiled as indicated in comments:
LBLHLM - Sharon G. Lias, John E. Bartmess, Joel F. Liebman, John L. Holmes, Rhoda D. Levin, and W. Gary Mallard
LLK - Sharon G. Lias, Rhoda D. Levin, and Sherif A. Kafafi

Ionization energy determinations

IE (eV) Method Reference Comment
7.46PEKlasinc, Kovac, et al., 1983LBLHLM
7.46 ± 0.03PEKlasinc, Kovac, et al., 1978Vertical value; LLK

References

Klasinc, Kovac, et al., 1983
Klasinc, L.; Kovac, B.; Gusten, H., Photoelectron spectra of acenes. Electronic structure and substituent effects, Pure Appl. Chem., 1983, 55, 289. [all data]

Klasinc, Kovac, et al., 1978
Klasinc, L.; Kovac, B.; Schoof, S.; Gusten, H., Photoelectron spectroscopy of 9-substituted anthracenes, Croat. Chem. Acta., 1978, 51, 307. [all data]