Multiflorine

Normal alkane RI, non-polar column, temperature ramp

Data compiled by: NIST Mass Spectrometry Data Center, William E. Wallace, director

Column type CapillaryCapillaryCapillaryCapillaryCapillary
Active phase DB-1DB-5DB-1SE-30SE-30
Column length (m) 30.30.30.15.15.
Carrier gas HeHe HeHe
Substrate
Column diameter (mm) 0.320.250.30.260.26
Phase thickness (μm)
Tstart (C) 150.180.150.150.150.
Tend (C) 300.300.270.270.270.
Heat rate (K/min) 6.5.6.6.6.
Initial hold (min)  2.
Final hold (min)  10.
I 2310.2320.2310.2320.2320.
ReferenceBeuerle, 2010Przybylak, Ciesiolka, et al., 2005Planchuelo-Ravelo and Wink, 1993Wink, Witte, et al., 1983Wink, Witte, et al., 1981
Comment MSDC-RI MSDC-RI MSDC-RI MSDC-RI MSDC-RI

References

Beuerle, 2010
Beuerle, T., MS and RI data. Personal communication., 2010. [all data]

Przybylak, Ciesiolka, et al., 2005
Przybylak, J.K.; Ciesiolka, D.; Wysocka, W.; García-López, P.M.; Ruiz-López, M.A.; Wysocki, W.; Gulewicz, K., Alkaloid profiles of Mexican wild lupin and an effect of alkaloid preparation from Lupinus exaltatus seeds on growth and yield of paprika (Capsicum annuum L.), Ind. Crops Prod., 2005, 21, 1, 1-7, https://doi.org/10.1016/j.indcrop.2003.12.001 . [all data]

Planchuelo-Ravelo and Wink, 1993
Planchuelo-Ravelo, A.M.; Wink, M., Alkaloid composition of Lupinus-albescens (Fabaceae) from South America, Z. Naturforsch. C:, 1993, 48, 5-6, 414-416. [all data]

Wink, Witte, et al., 1983
Wink, M.; Witte, L.; Hartmann, T.; Theuring, C.; Volz. V., Accumulation of quinolizidine alkaloids in plants and cell suspension cultures: genera lupinus, cytisus, baptisia, genista, laburnum, and sophora, Planta Medica, 1983, 48, 4, 253-257, https://doi.org/10.1055/s-2007-969928 . [all data]

Wink, Witte, et al., 1981
Wink, M.; Witte, L.; Hartmann. T., Quinolizidine Alkaloid Composition of Plants and of Photomixotrophis Cell Suspension Cultures of Sarothamnus scoparius and Orobanche rapum-genistae, Planta Medica, 1981, 43, 12, 342-352, https://doi.org/10.1055/s-2007-971522 . [all data]