2-Pyridylmethyl radica1

Gas phase ion energetics data

Data compiled by: Henry M. Rosenstock, Keith Draxl, Bruce W. Steiner, and John T. Herron

Ionization energy determinations

IE (eV) Method Reference
8.2 ± 0.1EIPalmer and Lossing, 1963

References

Palmer and Lossing, 1963
Palmer, T.F.; Lossing, F.P., Free radicals by mass spectrometry. XXX. Ionization potentials of anilino and 2-, 3-, and 4-pyridylmethyl radicals, J. Am. Chem. Soc., 1963, 85, 1733. [all data]