Benzaldehyde, 2-methyl-

Normal alkane RI, polar column, temperature ramp

Data compiled by: NIST Mass Spectrometry Data Center, William E. Wallace, director

Column type CapillaryCapillaryCapillaryCapillaryCapillary
Active phase DB-WaxDB-WaxDB-WaxDB-WaxDB-Wax
Column length (m) 30.30.30.30.30.
Carrier gas H2HeHeHeHe
Substrate
Column diameter (mm)  0.250.250.250.25
Phase thickness (μm) 0.250.250.250.250.25
Tstart (C) 60.60.60.60.60.
Tend (C) 230.230.230.230.230.
Heat rate (K/min) 8.8.8.8.8.
Initial hold (min) 5.5.5.5.5.
Final hold (min) 10.10.10.10.10.
I 1600.1621.1621.1622.1622.
ReferenceSteullet and Guerin, 1994Steullet and Guerin, 1994Steullet and Guerin, 1994Steullet and Guerin, 1994Steullet and Guerin, 1994
Comment MSDC-RI MSDC-RI MSDC-RI MSDC-RI MSDC-RI

References

Steullet and Guerin, 1994
Steullet, P.; Guerin, P.M., Identification of vertebrate volatiles stimulating olfactory receptors on tarsus I of the tick Amblyomma variegatum fabricus (Ixodidae). I. Receptors within the Haller's organ capsule, J. Comp. Physiol. A, 1994, 174, 1, 27-38, https://doi.org/10.1007/BF00192003 . [all data]