4-Nitrophenyl-4'-n-octyloxybenzoate

Condensed phase thermochemistry data

Data compiled by: Eugene S. Domalski and Elizabeth D. Hearing

Constant pressure heat capacity of solid

Cp,solid (J/mol*K) Temperature (K) Reference Comment
510.300.Rachwalska, Massalska-Arodz, et al., 1982T = 100 to 356 K. Data given graphically. Value given is an estimate from the graph.

References

Rachwalska, Massalska-Arodz, et al., 1982
Rachwalska, M.; Massalska-Arodz, M.; Moscicki, J.K.; Jaich, A., Calorimetric study of NPOB, Mol. Cryst. Liq. Cryst., 1982, 80, 157-164. [all data]