Hexane, 2,2,3,4-tetramethyl-

Kovats' RI, non-polar column, isothermal

Data compiled by: NIST Mass Spectrometry Data Center, William E. Wallace, director

Column type CapillaryCapillaryCapillaryCapillaryCapillary
Active phase SqualaneSqualaneVacuum Grease Oil (VM-4)SqualaneSqualane
Column length (m)   150.91.491.4
Carrier gas   N2N2N2
Substrate
Column diameter (mm)   0.250.250.25
Phase thickness (μm)
Temperature (C) 100.60.95.60.60.
I 909.908.8902.8903.915.
ReferenceHeinzen, Soares, et al., 1999Chretien and Dubois, 1976Sultanov and Arustamova, 1975Matukuma, 1969Matukuma, 1969
Comment MSDC-RI MSDC-RI MSDC-RI MSDC-RI MSDC-RI

Phase change data

Data compiled as indicated in comments:
TRC - Thermodynamics Research Center, NIST Boulder Laboratories, Chris Muzny director
AC - William E. Acree, Jr., James S. Chickos

Quantity Value Units Method Reference Comment
Tboil432.0KN/AFoehr and Fenske, 1949Uncertainty assigned by TRC = 1. K; TRC
Tboil427.5KN/AFenske, Braun, et al., 1947Uncertainty assigned by TRC = 1.5 K; TRC
Quantity Value Units Method Reference Comment
Δvap45.6kJ/molN/AReid, 1972AC

In addition to the Thermodynamics Research Center (TRC) data available from this site, much more physical and chemical property data is available from the following TRC products:

Normal alkane RI, non-polar column, custom temperature program

Data compiled by: NIST Mass Spectrometry Data Center, William E. Wallace, director

Column type Capillary
Active phase Polydimethyl siloxane
Column length (m)
Carrier gas
Substrate
Column diameter (mm)
Phase thickness (μm)
Program not specified
I 909.
ReferenceJunkes, Castanho, et al., 2003
Comment MSDC-RI

References

Heinzen, Soares, et al., 1999
Heinzen, V.E.F.; Soares, M.F.; Yunes, R.A., Semi-empirical topological method for the prediction of the chromatographic retention of cis- and trans-alkene isomers and alkanes, J. Chromatogr. A, 1999, 849, 2, 495-506, https://doi.org/10.1016/S0021-9673(99)00530-0 . [all data]

Chretien and Dubois, 1976
Chretien, J.R.; Dubois, J.-E., New Perspectives in the Prediction of Kovats Indices, J. Chromatogr., 1976, 126, 171-189, https://doi.org/10.1016/S0021-9673(01)84071-1 . [all data]

Sultanov and Arustamova, 1975
Sultanov, N.T.; Arustamova, L.G., Determination of the boiling points of C10 isoalkanes in an n-decane isomerizate from gas chromatographic retention indices, J. Chromatogr., 1975, 115, 2, 553-558, https://doi.org/10.1016/S0021-9673(01)98959-9 . [all data]

Matukuma, 1969
Matukuma, A., Retention indices of alkanes through C10 and alkenes through C8 and relation between boiling points and retention data, Gas Chromatogr., Int. Symp. Anal. Instrum. Div Instrum Soc. Amer., 1969, 7, 55-75. [all data]