Benzoic acid, 2,4,5-trimethyl-

Gas phase thermochemistry data

Data compiled by: Hussein Y. Afeefy, Joel F. Liebman, and Stephen E. Stein

Quantity Value Units Method Reference Comment
Δfgas-386.2 ± 2.1kJ/molCmColomina, Jimenez, et al., 1987see Colomina, Turrion, et al., 1964

Condensed phase thermochemistry data

Data compiled by: Hussein Y. Afeefy, Joel F. Liebman, and Stephen E. Stein

Quantity Value Units Method Reference Comment
Δfsolid-495.8 ± 2.0kJ/molCmColomina, Jimenez, et al., 1987see Colomina, Turrion, et al., 1964
Quantity Value Units Method Reference Comment
Δcsolid-5154.5 ± 1.3kJ/molCmColomina, Jimenez, et al., 1987see Colomina, Turrion, et al., 1964; Corresponding Δfsolid = -495.54 kJ/mol (simple calculation by NIST; no Washburn corrections)

Phase change data

Data compiled as indicated in comments:
ALS - Hussein Y. Afeefy, Joel F. Liebman, and Stephen E. Stein
DRB - Donald R. Burgess, Jr.
AC - William E. Acree, Jr., James S. Chickos

Quantity Value Units Method Reference Comment
Δsub109.6 ± 0.5kJ/molVColomina, Jimenez, et al., 1987see Colomina, Turrion, et al., 1964; ALS
Δsub109.6kJ/molN/AColomina, Jimenez, et al., 1987DRB
Δsub109.6 ± 0.5kJ/molMEColomina, Jimenez, et al., 1987Based on data from 324. - 346. K.; AC

Enthalpy of sublimation

ΔsubH (kJ/mol) Temperature (K) Method Reference Comment
108.3 ± 0.5335.MEColomina, Jimenez, et al., 1987Based on data from 324. - 346. K.; AC

Reaction thermochemistry data

Data compiled by: John E. Bartmess

Individual Reactions

C10H11O2- + Hydrogen cation = Benzoic acid, 2,4,5-trimethyl-

By formula: C10H11O2- + H+ = C10H12O2

Quantity Value Units Method Reference Comment
Δr1393. ± 8.8kJ/molIMREDecouzon, Gal, et al., 1997gas phase

References

Colomina, Jimenez, et al., 1987
Colomina, M.; Jimenez, P.; Roux, M.V.; Turrion, C., Thermochemical properties of benzoic acid derivatives. XV. Vapour pressures and enthalpies of sublimation and formation of the six trimethylbenzoic acids, J. Chem. Thermodyn., 1987, 19, 1139-1144. [all data]

Colomina, Turrion, et al., 1964
Colomina, M.; Turrion, C.; Boned, M.L.; Panea, M., Investigaciones termoquimicas sobre los acidos alquilbenzoicos. III. Acidos trimetilbenzoicos, Anal. Fisc. Quim. B, 1964, 60, 619-626. [all data]

Decouzon, Gal, et al., 1997
Decouzon, M.; Gal, J.-F.; Maria, P.-C.; Bohm, S.; Jimenez, P.; Roux, M.V.; Exner, O., Steric Effects in Crowded Molecules in the Gas Phase: Polymethyl Substituted Benzoic Acids, New J. Chem., 1997, 21, 561. [all data]