1,1'-Biphenyl,2,2'-di(methyl-d)-

Gas phase ion energetics data

Data compiled by: Sharon G. Lias, Rhoda D. Levin, and Sherif A. Kafafi

Appearance energy determinations

Ion AE (eV) Other Products MethodReferenceComment
C13H10D+11.8 ± 0.2CH2DEILoudon and Mazengo, 1974

References

Loudon and Mazengo, 1974
Loudon, A.G.; Mazengo, R.Z., Steric strain and electron-impact. The behaviour of some n, n'-dimethyl- 1,1-binaphthyls, some n, n'-dimethylbiphenyls and model compounds, Org. Mass Spectrom., 1974, 8, 179. [all data]