Si16Zr radical

Gas phase ion energetics data

Data compiled by: John E. Bartmess

Electron affinity determinations

EA (eV) Method Reference Comment
2.460 ± 0.080LPESFuruse, Koyasu, et al., 2008Vertical Detachment Energy: 2.92±0.02 eV
2.40 ± 0.10LPESKoyasu, Atobe, et al., 2008

References

Furuse, Koyasu, et al., 2008
Furuse, S.; Koyasu, K.; Atobe, J.; Nakajima, A., Experimental and theoretical characterization of MSi16-, MGe16-, MSn16-, and MPb16- (M = Ti, Zr, and Hf): The role of cage aromaticity, J. Chem. Phys., 2008, 129, 6, 064311, https://doi.org/10.1063/1.2966005 . [all data]

Koyasu, Atobe, et al., 2008
Koyasu, K.; Atobe, J.; Furuse, S.; Nakajima, A., Anion photoelectron spectroscopy of transition metal- and lanthanide metal-silicon clusters: MSin- (n=6-20), J. Chem. Phys., 2008, 129, 21, 214301, https://doi.org/10.1063/1.3023080 . [all data]