Dispiro[2.0.5.2]undecane

Gas phase ion energetics data

Data compiled as indicated in comments:
LBLHLM - Sharon G. Lias, John E. Bartmess, Joel F. Liebman, John L. Holmes, Rhoda D. Levin, and W. Gary Mallard

Ionization energy determinations

IE (eV) Method Reference Comment
8.5PESpanget-Larsen, Gleiter, et al., 1982LBLHLM
9.2PESpanget-Larsen, Gleiter, et al., 1982Vertical value; LBLHLM

References

Spanget-Larsen, Gleiter, et al., 1982
Spanget-Larsen, J.; Gleiter, R.; Gubernator, K.; Ternansky, R.J.; Paquette, L.A., Electronic and molecular structure of simple bicyclopropyls. Photoelectron spectroscopy and model calculations, J. Org. Chem., 1982, 47, 3082. [all data]