Haloperidol

Normal alkane RI, non-polar column, temperature ramp

Data compiled by: NIST Mass Spectrometry Data Center, William E. Wallace, director

Column type CapillaryPackedPacked
Active phase OV-1OV-1SE-30
Column length (m)  2.2.
Carrier gas
Substrate  Gas Chrom PGas Chrom P
Column diameter (mm)
Phase thickness (μm)
Tstart (C) 200.150.150.
Tend (C) 280.300.300.
Heat rate (K/min) 16.5.5.
Initial hold (min)
Final hold (min)
I 2942.2915.2970.
ReferenceSchutz and Wollrab A., 1988Marozzi, Gambaro, et al., 1982Marozzi, Gambaro, et al., 1982
Comment MSDC-RI MSDC-RI MSDC-RI

References

Schutz and Wollrab A., 1988
Schutz, H.; Wollrab A., The significance of the retention index in toxicologic analysis II, Pharmazie in unzerer Zeit, 1988, 17, 4, 97-101. [all data]

Marozzi, Gambaro, et al., 1982
Marozzi, E.; Gambaro, V.; Saligari, E.; Mariani, R.; Lodi, F., Use of the retention index in gas chromatographic studies of drugs, J. Anal. Toxicol., 1982, 6, 4, 185-192, https://doi.org/10.1093/jat/6.4.185 . [all data]