Benzeneethanamine,2,4-dimethoxy-α-methyl-(.+/-.)-

Gas phase ion energetics data

Data compiled by: Sharon G. Lias, Rhoda D. Levin, and Sherif A. Kafafi

Ionization energy determinations

IE (eV) Method Reference Comment
7.91 ± 0.06PEDomelsmith and Houk, 1978Vertical value
8.18 ± 0.06PEDomelsmith and Houk, 1978Vertical value

References

Domelsmith and Houk, 1978
Domelsmith, L.N.; Houk, K.N., Photoelectron spectroscopic studies of hallucinogens: The use of ionization potentials in QSAR, NIDA Res. Monogr., 1978, 22, 423. [all data]