Phosphinic acid, diethenyl-, isopropyl ester

Gas phase ion energetics data

Data compiled by: Sharon G. Lias, Rhoda D. Levin, and Sherif A. Kafafi

Ionization energy determinations

IE (eV) Method Reference Comment
9.2PEZverev, Villem, et al., 1981
10.06PEZverev, Villem, et al., 1981Vertical value

References

Zverev, Villem, et al., 1981
Zverev, V.V.; Villem, Y.Y.; Villem, N.V.; Liorber, B.G.; Kitaev, Y.P., Photoelectron spectra of some unsaturated three- and four-coordinate phosphorus compounds, J. Gen. Chem. USSR, 1981, 51, 303. [all data]