C6H5Ag

Gas phase ion energetics data

Data compiled by: John E. Bartmess

Electron affinity determinations

EA (eV) Method Reference Comment
0.660 ± 0.050LPESSun, Xing, et al., 2005

References

Sun, Xing, et al., 2005
Sun, S.T.; Xing, X.P.; Liu, H.T.; Tang, Z.C., Phenyl-coinage metal (Ag, Au) complexes: An anion photoelectron spectroscopy and density functional study, J. Phys. Chem. A, 2005, 109, 51, 11742-11751, https://doi.org/10.1021/jp054068i . [all data]