β-Asarone

Kovats' RI, non-polar column, temperature ramp

Data compiled by: NIST Mass Spectrometry Data Center, William E. Wallace, director

Column type Capillary
Active phase BP-1
Column length (m) 25.
Carrier gas N2
Substrate
Column diameter (mm) 0.32
Phase thickness (μm) 0.25
Tstart (C) 60.
Tend (C) 220.
Heat rate (K/min) 5.
Initial hold (min)
Final hold (min) 15.
I 1599.
ReferenceRaina, Srivastava, et al., 2003
Comment MSDC-RI

References

Raina, Srivastava, et al., 2003
Raina, V.K.; Srivastava, S.K.; Syamasunder, K.V., Essential oil composition of Acorus calamus L. from the lower region of the Himalayas, Flavour Fragr. J., 2003, 18, 1, 18-20, https://doi.org/10.1002/ffj.1136 . [all data]