Bis(trimethylphosphite-p-)iron dinitrosyl

Gas phase ion energetics data

Data compiled by: Henry M. Rosenstock, Keith Draxl, Bruce W. Steiner, and John T. Herron

Ionization energy determinations

IE (eV) Method Reference
7.25EIDistefano and Innorta, 1968

Appearance energy determinations

Ion AE (eV) Other Products MethodReferenceComment
C3H9N2O5PFe+9.75?EIDistefano and Innorta, 1968

References

Distefano and Innorta, 1968
Distefano, G.; Innorta, G., Iron-phosphorus bond dissociation energies in tetrahedral iron carbonyl nitrosyl complexes, J. Organometal. Chem., 1968, 14, 465. [all data]