1,1'-Biphenyl, 2,2',3,4-tetrachloro-

Kovats' RI, non-polar column, isothermal

View large format table.

Column type Active phase Temperature (C) I Reference Comment
CapillaryApiezon L200.2012.Krupcík, Leclercq, et al., 1980N2; Column length: 50. m; Column diameter: 0.25 mm
CapillaryOV-101150.1935.Zell, Neu, et al., 1977Column length: 27. m
CapillaryOV-101150.1936.Zell, Neu, et al., 1977Column length: 27. m

Normal alkane RI, non-polar column, isothermal

View large format table.

Column type Active phase Temperature (C) I Reference Comment
CapillaryApiezon L180.2000.Ballschmiter and Zell, 1980H2; Column length: 40. m; Column diameter: 0.30 mm
CapillaryApiezon L180.2000.Ballschmiter and Zell, 1980H2; Column length: 40. m; Column diameter: 0.30 mm

Normal alkane RI, non-polar column, temperature ramp

View large format table.

Column type Active phase I Reference Comment
CapillarySPB-11945.Nakano, Tsuji, et al., 198730. m/0.25 mm/0.25 μm, 4. K/min; Tstart: 130. C; Tend: 280. C

Normal alkane RI, non-polar column, custom temperature program

View large format table.

Column type Active phase I Reference Comment
CapillaryApolane1965.Bush, Murphy, et al., 1985He; Column length: 50. m; Column diameter: 0.25 mm; Program: 70 0C (2 min) 10 0C/min (6 min) 2 0C/min -> 250 0C
CapillaryApolane1965.Bush, Murphy, et al., 1985He; Column length: 50. m; Column diameter: 0.25 mm; Program: 70 0C (2 min) 10 0C/min (6 min) 2 0C/min -> 250 0C

References

Krupcík, Leclercq, et al., 1980
Krupcík, J.; Leclercq, P.A.; Garaj, J.; Símová, A., Analysis of alkylated mixtures of polychlorinated biphenyls by capillary gas chromatography-mass spectrometry, J. Chromatogr., 1980, 191, 207-220, https://doi.org/10.1016/S0021-9673(00)86381-5 . [all data]

Zell, Neu, et al., 1977
Zell, M.; Neu, H.J.; Ballschmiter, K., Identifizierung der PCB-Komponenten durch retentionsindexvergleich nach kapillar-gaschromatographie, Chemosphere, 1977, 2/3, 2-3, 69-76, https://doi.org/10.1016/0045-6535(77)90047-9 . [all data]

Ballschmiter and Zell, 1980
Ballschmiter, K.; Zell, M., Analysis of polychlorinated biphenyls (PCB) by glass capillary gas chromatography, Fresenius Z. Anal. Chem., 1980, 302, 1, 20-31, https://doi.org/10.1007/BF00469758 . [all data]

Nakano, Tsuji, et al., 1987
Nakano, T.; Tsuji, M.; Okuno, T., Analytical methods for PCB using GC/ECD and GC/MS with capillary column, Report of the Environmental Science Institute of Hyoho Prefecture, 1987, 19, 57-62. [all data]

Bush, Murphy, et al., 1985
Bush, B.; Murphy, M.J.; Connor, S.; Snow, J.; Barnard, E., Improvements in Glass Capillary Gas Chromatographic Polychlorobiphenyl Analysis, J. Chromatogr. Sci., 1985, 23, 11, 509-515, https://doi.org/10.1093/chromsci/23.11.509 . [all data]