[Cobalt(2-methylbenzoxazole)2Cl2]

Phase change data

Data compiled by: William E. Acree, Jr., James S. Chickos

Enthalpy of sublimation

ΔsubH (kJ/mol) Temperature (K) Method Reference Comment
92.4 ± 2.5368.DSCMortimer, 1984Based on data from 345. - 390. K. See also Mortimer and McNaughton, 1974.

References

Mortimer, 1984
Mortimer, C.T., Differential Scanning Calorimetry, 1984, 47-60, https://doi.org/10.1007/978-94-009-6312-24 . [all data]

Mortimer and McNaughton, 1974
Mortimer, C.T.; McNaughton, Janice L., The thermal decomposition of transition-metal complexes containing heterocyclic ligands, Thermochimica Acta, 1974, 8, 3, 265-269, https://doi.org/10.1016/0040-6031(74)87018-8 . [all data]