Iridium, (2,4-pentanedionato-o,o'-)-bisη2-ethene

Phase change data

Data compiled as indicated in comments:
MS - José A. Martinho Simões
AC - William E. Acree, Jr., James S. Chickos

Quantity Value Units Method Reference Comment
Δsub82.8 ± 4.2kJ/molN/AJesse, Ernsting, et al., 1978MS

Enthalpy of sublimation

ΔsubH (kJ/mol) Temperature (K) Method Reference Comment
82.8 ± 4.2297.MEJesse, Ernsting, et al., 1978, 2Based on data from 283. - 311. K. See also Stephenson and Malanowski, 1987.; AC

Reaction thermochemistry data

Data compiled by: José A. Martinho Simões

Individual Reactions

C9H15IrO2 (cr) + 2Carbon monoxide (g) = C7H7IrO4 (cr) + 2Ethylene (g)

By formula: C9H15IrO2 (cr) + 2CO (g) = C7H7IrO4 (cr) + 2C2H4 (g)

Quantity Value Units Method Reference Comment
Δr-74.1 ± 4.6kJ/molDSCJesse, Baks, et al., 1978

References

Jesse, Ernsting, et al., 1978
Jesse, A.C.; Ernsting, J.M.; Stufkens, D.J.; Vrieze, K., Thermochim. Acta, 1978, 25, 69. [all data]

Jesse, Ernsting, et al., 1978, 2
Jesse, A.C.; Ernsting, J.M.; Stufkens, D.J.; Vrieze, K., Vapour pressure measurements on (acac)M(substituted olefin)2 and (acac)M(CO)2 (M = Rh(I), Ir(I)), Thermochimica Acta, 1978, 25, 1, 69-75, https://doi.org/10.1016/0040-6031(78)80041-0 . [all data]

Stephenson and Malanowski, 1987
Stephenson, Richard M.; Malanowski, Stanislaw, Handbook of the Thermodynamics of Organic Compounds, 1987, https://doi.org/10.1007/978-94-009-3173-2 . [all data]

Jesse, Baks, et al., 1978
Jesse, A.C.; Baks, A.; Stufkens, D.J.; Vrieze, K., Inorg. Chim. Acta, 1978, 29, 177. [all data]