Quinoline, 6-methoxy-

Phase change data

Data compiled as indicated in comments:
BS - Robert L. Brown and Stephen E. Stein
AC - William E. Acree, Jr., James S. Chickos

Quantity Value Units Method Reference Comment
Δvap18.7 ± 0.55kcal/molCRibeiro da Silva, Santos, et al., 2003AC

Reduced pressure boiling point

Tboil (K) Pressure (atm) Reference Comment
466.20.066Aldrich Chemical Company Inc., 1990BS
426.20.016Weast and Grasselli, 1989BS
413. - 419.0.020Frinton Laboratories Inc., 1986BS

Van Den Dool and Kratz RI, non-polar column, temperature ramp

View large format table.

Column type Active phase I Reference Comment
CapillaryOV-11470.0Gautzsch and Zinn, 19968. K/min; Tstart: 35. C; Tend: 300. C

Normal alkane RI, polar column, custom temperature program

View large format table.

Column type Active phase I Reference Comment
CapillaryDB-Wax2353.Peng, Yang, et al., 1991Program: not specified

References

Ribeiro da Silva, Santos, et al., 2003
Ribeiro da Silva, Maria D.M.C.; Santos, Luis M.N.B.F.; Silva, Ana L.R.; Fernandes, Óscar; Acree, W.E., Energetics of 6-methoxyquinoline and 6-methoxyquinoline N-oxide: the dissociation enthalpy of the (N--O) bond, The Journal of Chemical Thermodynamics, 2003, 35, 7, 1093-1100, https://doi.org/10.1016/S0021-9614(03)00052-1 . [all data]

Aldrich Chemical Company Inc., 1990
Aldrich Chemical Company Inc., Catalog Handbook of Fine Chemicals, Aldrich Chemical Company, Inc., Milwaukee WI, 1990, 1. [all data]

Weast and Grasselli, 1989
CRC Handbook of Data on Organic Compounds, 2nd Editon, Weast,R.C and Grasselli, J.G., ed(s)., CRC Press, Inc., Boca Raton, FL, 1989, 1. [all data]

Frinton Laboratories Inc., 1986
Frinton Laboratories Inc., Catalog Number 11, Frinton Laboratories Inc., Vineland, NJ, 1986, 99. [all data]

Bliznyukov, 1953
Bliznyukov, V.I., On the reciprocal influence of substitutes in the anti-malarial preparation quinoline-45, Dokl. Akad. Nauk SSSR, 1953, 91, 9, 1337-1339. [all data]

Gautzsch and Zinn, 1996
Gautzsch, R.; Zinn, P., Use of incremental models to estimate the retention indexes of aromatic compounds, Chromatographia, 1996, 43, 3/4, 163-176, https://doi.org/10.1007/BF02292946 . [all data]

Peng, Yang, et al., 1991
Peng, C.T.; Yang, Z.C.; Ding, S.F., Prediction of rentention idexes. II. Structure-retention index relationship on polar columns, J. Chromatogr., 1991, 586, 1, 85-112, https://doi.org/10.1016/0021-9673(91)80028-F . [all data]