2H-Thiopyran, tetrahydro-3-methyl-

Phase change data

Data compiled by: William E. Acree, Jr., James S. Chickos

Enthalpy of vaporization

ΔvapH (kJ/mol) Temperature (K) Method Reference Comment
42.5336.N/ADykyj, Svoboda, et al., 1999Based on data from 321. - 460. K.
40.7376.A,EBStephenson and Malanowski, 1987Based on data from 361. - 435. K. See also White, Barnard--Smith, et al., 1952.

Normal alkane RI, non-polar column, temperature ramp

Data compiled by: NIST Mass Spectrometry Data Center, William E. Wallace, director

Column type Capillary
Active phase DB-1
Column length (m) 60.
Carrier gas He
Substrate
Column diameter (mm) 0.25
Phase thickness (μm) 1.
Tstart (C) 40.
Tend (C) 260.
Heat rate (K/min) 2.
Initial hold (min) 5.
Final hold (min) 60.
I 953.
ReferenceYu, Wu, et al., 1994
Comment MSDC-RI

Kovats' RI, non-polar column, isothermal

Data compiled by: NIST Mass Spectrometry Data Center, William E. Wallace, director

Column type Capillary
Active phase OV-101
Column length (m) 100.
Carrier gas H2
Substrate
Column diameter (mm) 0.25
Phase thickness (μm)
Temperature (C) 100.
I 939.
ReferenceGal'pern, Gollandskikh, et al., 1976
Comment MSDC-RI

References

Dykyj, Svoboda, et al., 1999
Dykyj, J.; Svoboda, J.; Wilhoit, R.C.; Frenkel, M.L.; Hall, K.R., Vapor Pressure of Chemicals: Part A. Vapor Pressure and Antoine Constants for Hydrocarbons and Sulfur, Selenium, Tellurium and Hydrogen Containing Organic Compounds, Springer, Berlin, 1999, 373. [all data]

Stephenson and Malanowski, 1987
Stephenson, Richard M.; Malanowski, Stanislaw, Handbook of the Thermodynamics of Organic Compounds, 1987, https://doi.org/10.1007/978-94-009-3173-2 . [all data]

White, Barnard--Smith, et al., 1952
White, P.T.; Barnard--Smith, D.G.; Fidler, F.A., Vapor Pressure--Temperature Relationships of Sulfur Compounds Related to Petroleum, Ind. Eng. Chem., 1952, 44, 6, 1430-1438, https://doi.org/10.1021/ie50510a064 . [all data]