Flavone

Phase change data

Data compiled by: William E. Acree, Jr., James S. Chickos

Quantity Value Units Method Reference Comment
Δsub108.2 ± 1.7kJ/molCSousa, Matos, et al., 2009

Enthalpy of fusion

ΔfusH (kJ/mol) Temperature (K) Method Reference
20.32369.9DSCSousa, Matos, et al., 2009

Normal alkane RI, non-polar column, temperature ramp

View large format table.

Column type Active phase I Reference Comment
CapillaryDB-12148.Binder and Flath, 198950. C @ 0.1 min, 4. K/min, 250. C @ 5. min; Column length: 60. m; Column diameter: 0.32 mm
PackedSE-302160.Das, Scott, et al., 1973He, Chromosorb G, 8. K/min; Column length: 2. m; Tstart: 100. C; Tend: 300. C

Normal alkane RI, non-polar column, custom temperature program

View large format table.

Column type Active phase I Reference Comment
CapillaryDB-12150.Binder and Flath, 1989Column length: 60. m; Column diameter: 0.32 mm; Program: not specified

References

Sousa, Matos, et al., 2009
Sousa, Clara C.S.; Matos, M. Agostinha R.; Morais, Victor M.F., Energetics of flavone and flavanone, The Journal of Chemical Thermodynamics, 2009, 41, 12, 1408-1412, https://doi.org/10.1016/j.jct.2009.06.022 . [all data]

Frolov, et al., 1975
Frolov, Yu.L., et al., Izvest. Akad. Nauk SSSR, ser. khim., 1975, 1294. [all data]

Binder and Flath, 1989
Binder, R.G.; Flath, R.A., Volatile components of pineapple guava, J. Agric. Food Chem., 1989, 37, 3, 734-736, https://doi.org/10.1021/jf00087a034 . [all data]

Das, Scott, et al., 1973
Das, N.P.; Scott, K.N.; Duncan, J.H., Identification of Flavanone Metabolites in Rat Urine by Combined Gas-Liquid Chromatography and Mass Spectrometry, Biochem. J., 1973, 136, 903-909. [all data]