(2R,4R)-4-Methyl-2-(2-methylprop-1-en-1-yl)tetrahydro-2H-pyran

Normal alkane RI, polar column, custom temperature program

Data compiled by: NIST Mass Spectrometry Data Center, William E. Wallace, director

Column type CapillaryCapillaryCapillaryCapillary
Active phase CP-Wax 52 CBCarbowax 20MCarbowax 20MDB-Wax
Column length (m) 50.  60.
Carrier gas Helium  N2
Substrate
Column diameter (mm) 0.25
Phase thickness (μm) 0.29  0.25
Program 33 0C (1 min) 2 0C/min -> 130 0C 10 0C/min -> 220 0Cnot specifiednot specifiednot specified
I 1341.1366.1370.1379.
ReferenceKaack and Christensen, 2008Vinogradov, 2004Vinogradov, 2004Weyerstahl, Marschall, et al., 1998
Comment MSDC-RI MSDC-RI MSDC-RI MSDC-RI

Van Den Dool and Kratz RI, non-polar column, temperature ramp

Data compiled by: NIST Mass Spectrometry Data Center, William E. Wallace, director

Column type CapillaryCapillary
Active phase Equity-5HP-5
Column length (m) 60.30.
Carrier gas HeHe
Substrate
Column diameter (mm) 0.250.25
Phase thickness (μm) 1.0.25
Tstart (C) 40.40.
Tend (C) 260.240.
Heat rate (K/min) 5.3.
Initial hold (min) 1.
Final hold (min) 15.
I 1149.1127.
ReferenceRocha, Coelho, et al., 2007Shellie and Marriott, 2003
Comment MSDC-RI MSDC-RI

References

Kaack and Christensen, 2008
Kaack, K.; Christensen, L.P., Effect of packing materials and storage time on volatile compounds in tea processes from flowers of black elder (Sambucus nigra L.), Eur. Food Res. Technol., 2008, 227, 4, 1259-1273, https://doi.org/10.1007/s00217-008-0844-8 . [all data]

Vinogradov, 2004
Vinogradov, B.A., Production, composition, properties and application of essential oils, 2004, retrieved from http://viness.narod.ru. [all data]

Weyerstahl, Marschall, et al., 1998
Weyerstahl, P.; Marschall, H.; Weirauch, M.; Thefeld, K.; Surburg, H., Constituents of commercial Labdanum oil, Flavour Fragr. J., 1998, 13, 5, 295-318, https://doi.org/10.1002/(SICI)1099-1026(1998090)13:5<295::AID-FFJ751>3.0.CO;2-I . [all data]