Copper vinylacetylenide

Condensed phase thermochemistry data

Data compiled as indicated in comments:
MS - José A. Martinho Simões
DH - Eugene S. Domalski and Elizabeth D. Hearing

Quantity Value Units Method Reference Comment
Δfsolid297.1 ± 2.8kJ/molReviewMartinho SimõesMS
Quantity Value Units Method Reference Comment
Δcsolid-2456. ± 1.7kJ/molCC-SBBykova and Lebedev, 1981MS
Quantity Value Units Method Reference Comment
solid,1 bar132.6J/mol*KN/ABykova and Lebedev, 1982DH

Constant pressure heat capacity of solid

Cp,solid (J/mol*K) Temperature (K) Reference Comment
109.4298.15Bykova and Lebedev, 1982T = 5 to 330 K.; DH

References

Martinho Simões
Martinho Simões, J.A., Private communication (see http://webbook.nist.gov/chemistry/om/). [all data]

Bykova and Lebedev, 1981
Bykova, T.A.; Lebedev, B.V., Khimiya Elementoorgan. Soedin., Gor'kii, 1981, 86.. [all data]

Bykova and Lebedev, 1982
Bykova, T.A.; Lebedev, B.V., Thermodynamic functions of a series of copper organoacetylenides in the range 0-330 K, SPSTL Deposited Publication 359, KhP-D81, 1982, 1-26. [all data]