diammonium phthalate

Condensed phase thermochemistry data

Data compiled by: Eugene S. Domalski and Elizabeth D. Hearing

Constant pressure heat capacity of solid

Cp,solid (J/mol*K) Temperature (K) Reference Comment
294.1323.Satoh and Sogabe, 1939T = 0 to 100 C. Mean value.

References

Satoh and Sogabe, 1939
Satoh, S.; Sogabe, T., The specific heats of some solid aromatic acids and their ammonium salts and the atomic heat of nitrogen, Sci. Pap. Inst. Phys. Chem. Res. (Tokyo), 1939, 36, 449-457. [all data]