Anthracene, 2-ethyl-

Phase change data

Data compiled by: William E. Acree, Jr., James S. Chickos

Quantity Value Units Method Reference Comment
Δvap21.8 ± 0.26kcal/molCGCHanshaw, Nutt, et al., 2008
Quantity Value Units Method Reference Comment
Δsub25.7 ± 0.1kcal/molMERibeiro da Silva, Amaral, et al., 2006Based on data from 343. - 359. K.

Enthalpy of sublimation

ΔsubH (kcal/mol) Temperature (K) Method Reference Comment
25.1 ± 0.1351.MERibeiro da Silva, Amaral, et al., 2006Based on data from 343. - 359. K.

References

Hanshaw, Nutt, et al., 2008
Hanshaw, William; Nutt, Marjorie; Chickos, James S., Hypothetical Thermodynamic Properties. Subcooled Vaporization Enthalpies and Vapor Pressures of Polyaromatic Hydrocarbons, J. Chem. Eng. Data, 2008, 53, 8, 1903-1913, https://doi.org/10.1021/je800300x . [all data]

Ribeiro da Silva, Amaral, et al., 2006
Ribeiro da Silva, Manuel A.V.; Amaral, Luísa M.P.F.; Santos, Ana Filipa L.O.M.; Gomes, José R.B., Thermochemistry of some alkylsubstituted anthracenes, The Journal of Chemical Thermodynamics, 2006, 38, 4, 367-375, https://doi.org/10.1016/j.jct.2005.06.001 . [all data]